Target
Cytochrome P450 1A2
Ligand
BDBM50220012
Substrate
Meas. Tech.
ChEMBL_445969 (CHEMBL896268)
IC50
>20000±n/a nM
Citation
 Reck, FZhou, FEyermann, CJKern, GCarcanague, DIoannidis, GIllingworth, RPoon, GGravestock, MB Novel substituted (pyridin-3-yl)phenyloxazolidinones: antibacterial agents with reduced activity against monoamine oxidase A and increased solubility. J Med Chem 50:4868-81 (2007)  
Target
Name:
Cytochrome P450 1A2
Synonyms:
CP1A2_HUMAN CYPIA2 Cytochrome P(3)450 Cytochrome P450 1A2 (CYP1A2) Cytochrome P450-P3
Type:
Enzyme
Mol. Mass.:
58423.38
Organism:
Homo sapiens (Human)
Description:
P05177
Residue:
516
  
Inhibitor
Name:
BDBM50220012
Synonyms:
(5R)-3-(3-fluoro-4-pyridin-3-ylphenyl)-5-(1H-1,2,3-triazol-1-ylmethyl)-1,3-oxazolidin-2-one | CHEMBL394864
Type:
Small organic molecule
Emp. Form.:
C17H14FN5O2
Mol. Mass.:
339.3238
SMILES:
Fc1cc(ccc1-c1cccnc1)N1C[C@H](Cn2ccnn2)OC1=O
: