Target
Cytochrome P450 2C9
Ligand
BDBM50220023
Substrate
Meas. Tech.
ChEMBL_445970 (CHEMBL896269)
IC50
8000±n/a nM
Citation
 Reck, FZhou, FEyermann, CJKern, GCarcanague, DIoannidis, GIllingworth, RPoon, GGravestock, MB Novel substituted (pyridin-3-yl)phenyloxazolidinones: antibacterial agents with reduced activity against monoamine oxidase A and increased solubility. J Med Chem 50:4868-81 (2007)  
Target
Name:
Cytochrome P450 2C9
Synonyms:
(R)-limonene 6-monooxygenase CP2C9_HUMAN CYP2C9 Cytochrome P450 2C9 (CYP2C9 ) P-450MP P450 PB-1 | S-mephenytoin 4-hydroxylase
Type:
Enzyme
Mol. Mass.:
55636.33
Organism:
Homo sapiens (Human)
Description:
P11712
Residue:
490
  
Inhibitor
Name:
BDBM50220023
Synonyms:
(5R)-3-{3-fluoro-4-[6-(1H-imidazol-1-ylacetyl)pyridin-3-yl]-phenyl}-5-(1H-1,2,3-triazol-1-ylmethyl)-1,3-oxazolidin-2-one | CHEMBL230964
Type:
Small organic molecule
Emp. Form.:
C22H18FN7O3
Mol. Mass.:
447.4218
SMILES:
Fc1cc(ccc1-c1ccc(nc1)C(=O)Cn1ccnc1)N1C[C@H](Cn2ccnn2)OC1=O
: