Target
Amine oxidase [flavin-containing] A
Ligand
BDBM50220036
Substrate
Meas. Tech.
ChEMBL_445968 (CHEMBL896267)
Ki
1700±n/a nM
Citation
 Reck, FZhou, FEyermann, CJKern, GCarcanague, DIoannidis, GIllingworth, RPoon, GGravestock, MB Novel substituted (pyridin-3-yl)phenyloxazolidinones: antibacterial agents with reduced activity against monoamine oxidase A and increased solubility. J Med Chem 50:4868-81 (2007)  
Target
Name:
Amine oxidase [flavin-containing] A
Synonyms:
AOFA_HUMAN MAO-A Monoamine oxidase Monoamine oxidase type A (MAO A) Monoamine oxidase type A (MAOA)
Type:
Protein
Mol. Mass.:
59689.53
Organism:
Homo sapiens (Human)
Description:
P21397
Residue:
527
  
Inhibitor
Name:
BDBM50220036
Synonyms:
(5R)-3-{3-fluoro-4-[6-(methoxymethyl)pyridin-3-yl]phenyl}-5-(1H-1,2,3-triazol-1-ylmethyl)-1,3-oxazolidin-2-one | CHEMBL231058
Type:
Small organic molecule
Emp. Form.:
C19H18FN5O3
Mol. Mass.:
383.3763
SMILES:
COCc1ccc(cn1)-c1ccc(cc1F)N1C[C@H](Cn2ccnn2)OC1=O
: