Target
Cytochrome P450 3A4
Ligand
BDBM50220012
Substrate
Meas. Tech.
ChEMBL_445973 (CHEMBL896272)
IC50
6800±n/a nM
Citation
 Reck, FZhou, FEyermann, CJKern, GCarcanague, DIoannidis, GIllingworth, RPoon, GGravestock, MB Novel substituted (pyridin-3-yl)phenyloxazolidinones: antibacterial agents with reduced activity against monoamine oxidase A and increased solubility. J Med Chem 50:4868-81 (2007)  
Target
Name:
Cytochrome P450 3A4
Synonyms:
Albendazole monooxygenase CP3A4_HUMAN CYP3A4 CYPIIIA4 Cytochrome P450 3A4 (CYP3A4) Nifedipine oxidase Taurochenodeoxycholate 6-alpha-hydroxylase
Type:
Enzyme
Mol. Mass.:
57349.57
Organism:
Homo sapiens (Human)
Description:
Residue:
503
  
Inhibitor
Name:
BDBM50220012
Synonyms:
(5R)-3-(3-fluoro-4-pyridin-3-ylphenyl)-5-(1H-1,2,3-triazol-1-ylmethyl)-1,3-oxazolidin-2-one | CHEMBL394864
Type:
Small organic molecule
Emp. Form.:
C17H14FN5O2
Mol. Mass.:
339.3238
SMILES:
Fc1cc(ccc1-c1cccnc1)N1C[C@H](Cn2ccnn2)OC1=O
: