Target
Cytochrome P450 2C19
Ligand
BDBM50220026
Substrate
Meas. Tech.
ChEMBL_445971 (CHEMBL896270)
IC50
>20000±n/a nM
Citation
 Reck, FZhou, FEyermann, CJKern, GCarcanague, DIoannidis, GIllingworth, RPoon, GGravestock, MB Novel substituted (pyridin-3-yl)phenyloxazolidinones: antibacterial agents with reduced activity against monoamine oxidase A and increased solubility. J Med Chem 50:4868-81 (2007)  
Target
Name:
Cytochrome P450 2C19
Synonyms:
(R)-limonene 6-monooxygenase (S)-limonene 7-monooxygenase CYP2C19 CYPIIC19 Cytochrome P450 2C19 [I331V] Cytochrome P450-254C Mephenytoin 4-hydroxylase P450-254C
Type:
Enzyme
Mol. Mass.:
55935.47
Organism:
Homo sapiens (Human)
Description:
P33261
Residue:
490
  
Inhibitor
Name:
BDBM50220026
Synonyms:
(5R)-3-(3-fluoro-4-{6-[(2-methyl-1H-imidazol-1-yl)acetyl]pyridin-3-yl}phenyl)-5-(1H-1,2,3-triazol-1-ylmethyl)-1,3-oxazolidin-2-one | CHEMBL388012
Type:
Small organic molecule
Emp. Form.:
C23H20FN7O3
Mol. Mass.:
461.4484
SMILES:
Cc1nccn1CC(=O)c1ccc(cn1)-c1ccc(cc1F)N1C[C@H](Cn2ccnn2)OC1=O
: