Target
Cytochrome P450 2D6
Ligand
BDBM50220017
Substrate
Meas. Tech.
ChEMBL_445972 (CHEMBL896271)
IC50
>20000±n/a nM
Citation
 Reck, FZhou, FEyermann, CJKern, GCarcanague, DIoannidis, GIllingworth, RPoon, GGravestock, MB Novel substituted (pyridin-3-yl)phenyloxazolidinones: antibacterial agents with reduced activity against monoamine oxidase A and increased solubility. J Med Chem 50:4868-81 (2007)  
Target
Name:
Cytochrome P450 2D6
Synonyms:
CP2D6_HUMAN CYP2DL1 Cytochrome P450 2D6 (CYP2D6) P450-DB1
Type:
Protein
Mol. Mass.:
55774.82
Organism:
Homo sapiens (Human)
Description:
P10635
Residue:
497
  
Inhibitor
Name:
BDBM50220017
Synonyms:
(5R)-3-(3-fluoro-4-{6-[(4-methyl-1H-imidazol-1-yl)acetyl]pyridin-3-yl}phenyl)-5-(1H-1,2,3-triazol-1-ylmethyl)-1,3-oxazolidin-2-one | CHEMBL387785
Type:
Small organic molecule
Emp. Form.:
C23H20FN7O3
Mol. Mass.:
461.4484
SMILES:
Cc1cn(CC(=O)c2ccc(cn2)-c2ccc(cc2F)N2C[C@H](Cn3ccnn3)OC2=O)cn1
: