Target
Amine oxidase [flavin-containing] A
Ligand
BDBM50220039
Substrate
Meas. Tech.
ChEMBL_445968 (CHEMBL896267)
Ki
41000±n/a nM
Citation
 Reck, FZhou, FEyermann, CJKern, GCarcanague, DIoannidis, GIllingworth, RPoon, GGravestock, MB Novel substituted (pyridin-3-yl)phenyloxazolidinones: antibacterial agents with reduced activity against monoamine oxidase A and increased solubility. J Med Chem 50:4868-81 (2007)  
Target
Name:
Amine oxidase [flavin-containing] A
Synonyms:
AOFA_HUMAN MAO-A Monoamine oxidase Monoamine oxidase type A (MAO A) Monoamine oxidase type A (MAOA)
Type:
Protein
Mol. Mass.:
59689.53
Organism:
Homo sapiens (Human)
Description:
P21397
Residue:
527
  
Inhibitor
Name:
BDBM50220039
Synonyms:
(5R)-3-(3-fluoro-4-{6-[1-hydroxy-4-(4-methylpiperazin-1-yl)-butyl]pyridin-3-yl}phenyl)-5-(1H-1,2,3-triazol-1-ylmethyl)-1,3-oxazolidin-2-one | CHEMBL390405
Type:
Small organic molecule
Emp. Form.:
C26H32FN7O3
Mol. Mass.:
509.5758
SMILES:
CN1CCN(CCCC(O)c2ccc(cn2)-c2ccc(cc2F)N2C[C@H](Cn3ccnn3)OC2=O)CC1
: