Target
Cytochrome P450 3A4
Ligand
BDBM50220017
Substrate
Meas. Tech.
ChEMBL_445973 (CHEMBL896272)
IC50
>20000±n/a nM
Citation
 Reck, FZhou, FEyermann, CJKern, GCarcanague, DIoannidis, GIllingworth, RPoon, GGravestock, MB Novel substituted (pyridin-3-yl)phenyloxazolidinones: antibacterial agents with reduced activity against monoamine oxidase A and increased solubility. J Med Chem 50:4868-81 (2007)  
Target
Name:
Cytochrome P450 3A4
Synonyms:
Albendazole monooxygenase CP3A4_HUMAN CYP3A4 CYPIIIA4 Cytochrome P450 3A4 (CYP3A4) Nifedipine oxidase Taurochenodeoxycholate 6-alpha-hydroxylase
Type:
Enzyme
Mol. Mass.:
57349.57
Organism:
Homo sapiens (Human)
Description:
Residue:
503
  
Inhibitor
Name:
BDBM50220017
Synonyms:
(5R)-3-(3-fluoro-4-{6-[(4-methyl-1H-imidazol-1-yl)acetyl]pyridin-3-yl}phenyl)-5-(1H-1,2,3-triazol-1-ylmethyl)-1,3-oxazolidin-2-one | CHEMBL387785
Type:
Small organic molecule
Emp. Form.:
C23H20FN7O3
Mol. Mass.:
461.4484
SMILES:
Cc1cn(CC(=O)c2ccc(cn2)-c2ccc(cc2F)N2C[C@H](Cn3ccnn3)OC2=O)cn1
: