Target
Cytochrome P450 2D6
Ligand
BDBM50220012
Substrate
Meas. Tech.
ChEMBL_445972 (CHEMBL896271)
IC50
6600±n/a nM
Citation
 Reck, FZhou, FEyermann, CJKern, GCarcanague, DIoannidis, GIllingworth, RPoon, GGravestock, MB Novel substituted (pyridin-3-yl)phenyloxazolidinones: antibacterial agents with reduced activity against monoamine oxidase A and increased solubility. J Med Chem 50:4868-81 (2007)  
Target
Name:
Cytochrome P450 2D6
Synonyms:
CP2D6_HUMAN CYP2DL1 Cytochrome P450 2D6 (CYP2D6) P450-DB1
Type:
Protein
Mol. Mass.:
55774.82
Organism:
Homo sapiens (Human)
Description:
P10635
Residue:
497
  
Inhibitor
Name:
BDBM50220012
Synonyms:
(5R)-3-(3-fluoro-4-pyridin-3-ylphenyl)-5-(1H-1,2,3-triazol-1-ylmethyl)-1,3-oxazolidin-2-one | CHEMBL394864
Type:
Small organic molecule
Emp. Form.:
C17H14FN5O2
Mol. Mass.:
339.3238
SMILES:
Fc1cc(ccc1-c1cccnc1)N1C[C@H](Cn2ccnn2)OC1=O
: