Target
Mu-type opioid receptor
Ligand
BDBM50221423
Substrate
Meas. Tech.
ChEMBL_449627 (CHEMBL898719)
IC50
16±n/a nM
Citation
 Shiotani, KLi, TMiyazaki, ATsuda, YYokoi, TAmbo, ASasaki, YBryant, SDLazarus, LHOkada, Y Design and synthesis of opioidmimetics containing 2',6'-dimethyl-L-tyrosine and a pyrazinone-ring platform. Bioorg Med Chem Lett 17:5768-71 (2007)  
Target
Name:
Mu-type opioid receptor
Synonyms:
M-OR-1 Mu opioid receptor OPIATE Mu OPRM_CAVPO
Type:
Enzyme Catalytic Domain
Mol. Mass.:
11165.58
Organism:
GUINEA PIG
Description:
P97266
Residue:
98
  
Inhibitor
Name:
BDBM50221423
Synonyms:
(S)-2-amino-3-(4-hydroxy-2,6-dimethylphenyl)-N-(4-(6-methyl-3-oxo-5-phenethyl-3,4-dihydropyrazin-2-yl)butyl)propanamide | CHEMBL236662
Type:
Small organic molecule
Emp. Form.:
C28H36N4O3
Mol. Mass.:
476.6104
SMILES:
Cc1cc(O)cc(C)c1C[C@H](N)C(=O)NCCCCc1nc(C)c(CCc2ccccc2)[nH]c1=O
: