Target
Polyunsaturated fatty acid lipoxygenase ALOX12
Ligand
BDBM50222310
Substrate
Meas. Tech.
ChEMBL_457824 (CHEMBL924094)
IC50
>100000±n/a nM
Citation
 Vasquez-Martinez, YOhri, RVKenyon, VHolman, TRSepúlveda-Boza, S Structure-activity relationship studies of flavonoids as potent inhibitors of human platelet 12-hLO, reticulocyte 15-hLO-1, and prostate epithelial 15-hLO-2. Bioorg Med Chem 15:7408-25 (2007)  
Target
Name:
Polyunsaturated fatty acid lipoxygenase ALOX12
Synonyms:
12-LOX 12LO Arachidonate 12-lipoxygenase LOG12 Platelet 12-lipoxygenase | Platelet-type lipoxygenase 12
Type:
Protein
Mol. Mass.:
75689.18
Organism:
Homo sapiens (Human)
Description:
P18054
Residue:
663
  
Inhibitor
Name:
BDBM50222310
Synonyms:
7-hydroxy-2-isopropyl-4H-benzopyran-4-one | CHEMBL241364
Type:
Small organic molecule
Emp. Form.:
C12H12O3
Mol. Mass.:
204.2219
SMILES:
CC(C)c1cc(=O)c2ccc(O)cc2o1
: