Target
Polyunsaturated fatty acid lipoxygenase ALOX15
Ligand
BDBM50222310
Substrate
Meas. Tech.
ChEMBL_457825 (CHEMBL924095)
IC50
>100000±n/a nM
Citation
 Vasquez-Martinez, YOhri, RVKenyon, VHolman, TRSepúlveda-Boza, S Structure-activity relationship studies of flavonoids as potent inhibitors of human platelet 12-hLO, reticulocyte 15-hLO-1, and prostate epithelial 15-hLO-2. Bioorg Med Chem 15:7408-25 (2007)  
Target
Name:
Polyunsaturated fatty acid lipoxygenase ALOX15
Synonyms:
15-Lipoxygenase-1 (15-LOX-1) Arachidonate 15-lipoxygenase LOG15 Reticulocyte 15-lipoxygenase-1 | Sphingosine 1-phosphate receptor 1 (S1P1)
Type:
Protein
Mol. Mass.:
74804.05
Organism:
Homo sapiens (Human)
Description:
Residue:
662
  
Inhibitor
Name:
BDBM50222310
Synonyms:
7-hydroxy-2-isopropyl-4H-benzopyran-4-one | CHEMBL241364
Type:
Small organic molecule
Emp. Form.:
C12H12O3
Mol. Mass.:
204.2219
SMILES:
CC(C)c1cc(=O)c2ccc(O)cc2o1
: