Target
5-hydroxytryptamine receptor 6
Ligand
BDBM50223307
Substrate
Meas. Tech.
ChEMBL_458154 (CHEMBL924411)
Ki
1221±n/a nM
Citation
 Tasler, SKraus, JWuzik, AMüller, OAschenbrenner, ACubero, EPascual, RQuintana-Ruiz, JRDordal, AMercè, RCodony, X Discovery of 5-HT6 receptor ligands based on virtual HTS. Bioorg Med Chem Lett 17:6224-9 (2007)  
Target
Name:
5-hydroxytryptamine receptor 6
Synonyms:
5-HT-6 5-hydroxytryptamine receptor 6 (5-HT-6) 5-hydroxytryptamine receptor 6 (5HT6) HTR6 Serotonin 6 (5-HT6) receptor | Serotonin Receptor 6
Type:
G Protein-Coupled Receptor (GPCR)
Mol. Mass.:
46968.43
Organism:
Homo sapiens (Human)
Description:
P50406
Residue:
440
  
Inhibitor
Name:
BDBM50223307
Synonyms:
2-(5-(4-methylpiperazin-1-yl)-2-nitrophenyl)-4-phenylphthalazin-1(2H)-one | CHEMBL250840
Type:
Small organic molecule
Emp. Form.:
C25H23N5O3
Mol. Mass.:
441.4818
SMILES:
CN1CCN(CC1)c1ccc(c(c1)-n1nc(-c2ccccc2)c2ccccc2c1=O)[N+]([O-])=O
: