Target
Alpha-1A adrenergic receptor
Ligand
BDBM50211324
Substrate
Meas. Tech.
ChEMBL_450222 (CHEMBL900497)
Ki
23±n/a nM
Citation
 Chiu, GLi, SCai, HConnolly, PJPeng, SStauber, KPulito, VLiu, JMiddleton, SA Aminocyclohexylsulfonamides: discovery of metabolically stable alpha(1a/1d)-selective adrenergic receptor antagonists for the treatment of benign prostatic hyperplasia/lower urinary tract symptoms (BPH/LUTS). Bioorg Med Chem Lett 17:6123-8 (2007)  
Target
Name:
Alpha-1A adrenergic receptor
Synonyms:
ADA1A_HUMAN ADRA1C Alpha 1A-adrenoceptor Alpha adrenergic receptor 1a Alpha-adrenergic receptor 1c adrenergic Alpha1 | adrenergic Alpha1C
Type:
Cell-surface receptors
Mol. Mass.:
51511.67
Organism:
Homo sapiens (Human)
Description:
P35348
Residue:
466
  
Inhibitor
Name:
BDBM50211324
Synonyms:
CHEMBL236621 | N-((1r,4r)-4-(4-(2-isopropoxyphenyl)piperazin-1-yl)cyclohexyl)-3,4-dimethoxybenzenesulfonamide
Type:
Small organic molecule
Emp. Form.:
C27H39N3O5S
Mol. Mass.:
517.681
SMILES:
COc1ccc(cc1OC)S(=O)(=O)N[C@H]1CC[C@@H](CC1)N1CCN(CC1)c1ccccc1OC(C)C
: