Target
D(2) dopamine receptor
Ligand
BDBM50213533
Substrate
Meas. Tech.
ChEMBL_450225 (CHEMBL900500)
Ki
88±n/a nM
Citation
 Chiu, GLi, SCai, HConnolly, PJPeng, SStauber, KPulito, VLiu, JMiddleton, SA Aminocyclohexylsulfonamides: discovery of metabolically stable alpha(1a/1d)-selective adrenergic receptor antagonists for the treatment of benign prostatic hyperplasia/lower urinary tract symptoms (BPH/LUTS). Bioorg Med Chem Lett 17:6123-8 (2007)  
Target
Name:
D(2) dopamine receptor
Synonyms:
D(2) dopamine receptor DOPAMINE D2 Long DRD2 Dopamine D2 receptor Dopamine D2 receptor (D2R) Dopamine2-like | d2
Type:
Cell-surface receptors
Mol. Mass.:
50647.10
Organism:
Homo sapiens (Human)
Description:
P14416
Residue:
443
  
Inhibitor
Name:
BDBM50213533
Synonyms:
CHEMBL228607 | N-((1r,4r)-4-(4-(2-(2,2-difluoroethoxy)phenyl)piperidin-1-yl)cyclohexyl)-3,4-dimethoxybenzenesulfonamide
Type:
Small organic molecule
Emp. Form.:
C27H36F2N2O5S
Mol. Mass.:
538.647
SMILES:
COc1ccc(cc1OC)S(=O)(=O)N[C@H]1CC[C@@H](CC1)N1CCC(CC1)c1ccccc1OCC(F)F
: