Target
Albumin
Ligand
BDBM50223891
Substrate
Meas. Tech.
ChEMBL_458251 (CHEMBL925586)
Kd
420±n/a nM
Citation
 Urbahns, KHärter, MAlbers, MSchmidt, DStelte-Ludwig, BBrüggemeier, UVaupel, AKeldenich, JLustig, KTsujishita, HGerdes, C Biphenyls as potent vitronectin receptor antagonists. Part 3: Squaric acid amides. Bioorg Med Chem Lett 17:6151-4 (2007)  
Target
Name:
Albumin
Synonyms:
ALB Serum albumin
Type:
PROTEIN
Mol. Mass.:
69362.94
Organism:
Homo sapiens (Human)
Description:
ChEMBL_1509401
Residue:
609
  
Inhibitor
Name:
BDBM50223891
Synonyms:
(S)-3-[3'-(2-cyclopropylamino-3,4-dioxo-cyclobut-1-enylamino)-biphenyl-4-yl]-2-(2,4,6-trimethyl-benzenesulfonylamino)-propionic acid | CHEMBL249990
Type:
Small organic molecule
Emp. Form.:
C31H31N3O6S
Mol. Mass.:
573.659
SMILES:
Cc1cc(C)c(c(C)c1)S(=O)(=O)N[C@@H](Cc1ccc(cc1)-c1cccc(Nc2c(NC3CC3)c(=O)c2=O)c1)C(O)=O
: