Target
Prothrombin
Ligand
BDBM50224701
Substrate
Meas. Tech.
ChEMBL_458334 (CHEMBL941668)
Ki
>21000±n/a nM
Citation
 Varnes, JGWacker, DAJacobson, ICQuan, MLEllis, CDRossi, KAHe, MYLuettgen, JMKnabb, RMBai, SHe, KLam, PYWexler, RR Design, structure-activity relationship, and pharmacokinetic profile of pyrazole-based indoline factor Xa inhibitors. Bioorg Med Chem Lett 17:6481-8 (2007)  
Target
Name:
Prothrombin
Synonyms:
Activation peptide fragment 1 Coagulation factor II Prothrombin precursor Thrombin heavy chain | Thrombin light chain
Type:
Protein
Mol. Mass.:
70029.57
Organism:
Homo sapiens (Human)
Description:
P00734
Residue:
622
  
Inhibitor
Name:
BDBM50224701
Synonyms:
1-(1-(3-aminobenzo[d]isoxazol-5-yl)-3-(trifluoromethyl)-1H-pyrazole-5-carbonyl)-6-(2-(methylsulfonyl)phenyl)-2,3-dihydroquinolin-4(1H)-one | CHEMBL398517
Type:
Small organic molecule
Emp. Form.:
C28H20F3N5O5S
Mol. Mass.:
595.549
SMILES:
CS(=O)(=O)c1ccccc1-c1ccc2N(CCC(=O)c2c1)C(=O)c1cc(nn1-c1ccc2onc(N)c2c1)C(F)(F)F
: