Target
Beta-lactamase TEM
Ligand
BDBM50225374
Substrate
Meas. Tech.
ChEMBL_451362 (CHEMBL901565)
Ki
170±n/a nM
Citation
 Venturelli, ATondi, DCancian, LMorandi, FCannazza, GSegatore, BPrati, FAmicosante, GShoichet, BKCosti, MP Optimizing cell permeation of an antibiotic resistance inhibitor for improved efficacy. J Med Chem 50:5644-54 (2007)  
Target
Name:
Beta-lactamase TEM
Synonyms:
BLAT_ECOLX Beta-lactamase (TEM-1) Beta-lactamase TEM-1 Beta-lactamase TEM1D Beta-lactamase TEM1F TEM extended-spectrum beta-lactamase bla
Type:
Enzyme
Mol. Mass.:
31512.33
Organism:
Escherichia coli
Description:
P62593
Residue:
286
  
Inhibitor
Name:
BDBM50225374
Synonyms:
5 [(1,2,4-triazol-1-ylmethyl]benzo[b]thiophen-2-ylboronic acid | CHEMBL235951
Type:
Small organic molecule
Emp. Form.:
C11H12BN4O2S
Mol. Mass.:
275.114
SMILES:
Nn1cn[n+](Cc2ccc3sc(cc3c2)B(O)O)c1
: