Target
Cannabinoid receptor 2
Ligand
BDBM21278
Substrate
Meas. Tech.
ChEMBL_451877 (CHEMBL901032)
Ki
1990±n/a nM
Citation
 Srivastava, BKJoharapurkar, ARaval, SPatel, JZSoni, RRaval, PGite, AGoswami, ASadhwani, NGandhi, NPatel, HMishra, BSolanki, MPandey, BJain, MRPatel, PR Diaryl dihydropyrazole-3-carboxamides with significant in vivo antiobesity activity related to CB1 receptor antagonism: synthesis, biological evaluation, and molecular modeling in the homology model. J Med Chem 50:5951-66 (2007)  
Target
Name:
Cannabinoid receptor 2
Synonyms:
CANNABINOID CB2 CB2 CB2B CNR2_HUMAN Cannabinoid CB2 receptor Cannabinoid receptor 2 (CB2R) | hCB2
Type:
G Protein-Coupled Receptor (GPCR)
Mol. Mass.:
39690.94
Organism:
Homo sapiens (Human)
Description:
P34972
Residue:
360
  
Inhibitor
Name:
BDBM21278
Synonyms:
5-(4-chlorophenyl)-1-(2,4-dichlorophenyl)-4-methyl-N-(piperidin-1-yl)-1H-pyrazole-3-carboxamide CHEMBL111 RIMONABANT HYDROCHLORIDE SR 141716A SR141716A [3H]SR141716A
Type:
Small organic molecule
Emp. Form.:
C22H21Cl3N4O
Mol. Mass.:
463.787
SMILES:
Cc1c(nn(c1-c1ccc(Cl)cc1)-c1ccc(Cl)cc1Cl)C(=O)NN1CCCCC1
: