Target
Translocator protein
Ligand
BDBM50122293
Substrate
Meas. Tech.
ChEMBL_460136 (CHEMBL924983)
Ki
0.242±n/a nM
Citation
 Briard, EZoghbi, SSImaizumi, MGourley, JPShetty, HUHong, JCropley, VFujita, MInnis, RBPike, VW Synthesis and evaluation in monkey of two sensitive 11C-labeled aryloxyanilide ligands for imaging brain peripheral benzodiazepine receptors in vivo. J Med Chem 51:17-30 (2008)  
Target
Name:
Translocator protein
Synonyms:
BZRP Mitochondrial benzodiazepine receptor PKBS Peripheral-type benzodiazepine receptor TSPO_HUMAN
Type:
Enzyme
Mol. Mass.:
18834.74
Organism:
Homo sapiens (Human)
Description:
P30536
Residue:
169
  
Inhibitor
Name:
BDBM50122293
Synonyms:
CHEMBL401000 N-(2,5-Dimethoxy-benzyl)-N-(5-fluoro-2-phenoxy-phenyl)-acetamide N-(2,5-dimethoxybenzyl)-N-(5-fluoro-2-phenoxyphenyl)acetamide
Type:
Small organic molecule
Emp. Form.:
C23H22FNO4
Mol. Mass.:
395.4235
SMILES:
COc1ccc(OC)c(CN(C(C)=O)c2cc(F)ccc2Oc2ccccc2)c1
: