Target
Translocator protein
Ligand
BDBM50229593
Substrate
Meas. Tech.
ChEMBL_460138 (CHEMBL924980)
Ki
0.0978±n/a nM
Citation
 Briard, EZoghbi, SSImaizumi, MGourley, JPShetty, HUHong, JCropley, VFujita, MInnis, RBPike, VW Synthesis and evaluation in monkey of two sensitive 11C-labeled aryloxyanilide ligands for imaging brain peripheral benzodiazepine receptors in vivo. J Med Chem 51:17-30 (2008)  
Target
Name:
Translocator protein
Synonyms:
Benzodiazepine receptors; peripheral & central Mbr PBR Peripheral benzodiazepine receptor (PBR) TSPO_RAT | Tspo
Type:
Mitochondrion membrane protein
Mol. Mass.:
18945.84
Organism:
Rattus norvegicus (rat)
Description:
Competitive binding experiments were performed on rat kidney mitochondrial membranes.
Residue:
169
  
Inhibitor
Name:
BDBM50229593
Synonyms:
CHEMBL253596 | N-acetyl-N-(2-methoxycarbonylbenzyl)-2-phenoxyaniline
Type:
Small organic molecule
Emp. Form.:
C23H21NO4
Mol. Mass.:
375.4171
SMILES:
COC(=O)c1ccccc1CN(C(C)=O)c1ccccc1Oc1ccccc1
: