Target
Translocator protein
Ligand
BDBM50229596
Substrate
Meas. Tech.
ChEMBL_460138 (CHEMBL924980)
Ki
0.73±n/a nM
Citation
 Briard, EZoghbi, SSImaizumi, MGourley, JPShetty, HUHong, JCropley, VFujita, MInnis, RBPike, VW Synthesis and evaluation in monkey of two sensitive 11C-labeled aryloxyanilide ligands for imaging brain peripheral benzodiazepine receptors in vivo. J Med Chem 51:17-30 (2008)  
Target
Name:
Translocator protein
Synonyms:
Benzodiazepine receptors; peripheral & central Mbr PBR Peripheral benzodiazepine receptor (PBR) TSPO_RAT | Tspo
Type:
Mitochondrion membrane protein
Mol. Mass.:
18945.84
Organism:
Rattus norvegicus (rat)
Description:
Competitive binding experiments were performed on rat kidney mitochondrial membranes.
Residue:
169
  
Inhibitor
Name:
BDBM50229596
Synonyms:
1-(2-chlorophenyl)-N-methyl-N-[(1S)-1-methylpropyl]isoquinoline-3-carboxamide PK-11195
Type:
Small organic molecule
Emp. Form.:
C21H21ClN2O
Mol. Mass.:
352.857
SMILES:
CC[C@H](C)N(C)C(=O)c1cc2ccccc2c(n1)-c1ccccc1Cl
: