Target
Translocator protein
Ligand
BDBM50122293
Substrate
Meas. Tech.
ChEMBL_460138 (CHEMBL924980)
Ki
0.0726±n/a nM
Citation
 Briard, EZoghbi, SSImaizumi, MGourley, JPShetty, HUHong, JCropley, VFujita, MInnis, RBPike, VW Synthesis and evaluation in monkey of two sensitive 11C-labeled aryloxyanilide ligands for imaging brain peripheral benzodiazepine receptors in vivo. J Med Chem 51:17-30 (2008)  
Target
Name:
Translocator protein
Synonyms:
Benzodiazepine receptors; peripheral & central Mbr PBR Peripheral benzodiazepine receptor (PBR) TSPO_RAT | Tspo
Type:
Mitochondrion membrane protein
Mol. Mass.:
18945.84
Organism:
Rattus norvegicus (rat)
Description:
Competitive binding experiments were performed on rat kidney mitochondrial membranes.
Residue:
169
  
Inhibitor
Name:
BDBM50122293
Synonyms:
CHEMBL401000 N-(2,5-Dimethoxy-benzyl)-N-(5-fluoro-2-phenoxy-phenyl)-acetamide N-(2,5-dimethoxybenzyl)-N-(5-fluoro-2-phenoxyphenyl)acetamide
Type:
Small organic molecule
Emp. Form.:
C23H22FNO4
Mol. Mass.:
395.4235
SMILES:
COc1ccc(OC)c(CN(C(C)=O)c2cc(F)ccc2Oc2ccccc2)c1
: