Target
72 kDa type IV collagenase
Ligand
BDBM11868
Substrate
Meas. Tech.
ChEMBL_461864 (CHEMBL927857)
IC50
<1.5±n/a nM
Citation
 Burns, DMHe, CLi, YScherle, PLiu, XMarando, CACovington, MBYang, GPan, MTurner, SFridman, JSHollis, GVaddi, KYeleswaram, SNewton, RFriedman, SMetcalf, BYao, W Conversion of an MMP-potent scaffold to an MMP-selective HER-2 sheddase inhibitor via scaffold hybridization and subtle P1' permutations. Bioorg Med Chem Lett 18:560-4 (2008)  
Target
Name:
72 kDa type IV collagenase
Synonyms:
72 kDa gelatinase CLG4A Gelatinase A (MMP-2) MMP2_HUMAN Matrix metalloproteinase-2 (MMP 2) Matrix metalloproteinases 2 (MMP-2) | TBE-1
Type:
Enzyme
Mol. Mass.:
73870.36
Organism:
Homo sapiens (Human)
Description:
P08253
Residue:
660
  
Inhibitor
Name:
BDBM11868
Synonyms:
CHEMBL256157 N-hydroxy-4-{[(4-phenoxybenzene)sulfonyl]methyl}-1-(prop-2-yn-1-yl)piperidine-4-carboxamide hydrochloride | beta-sulfone 7e
Type:
Small organic molecule
Emp. Form.:
C22H24N2O5S
Mol. Mass.:
428.501
SMILES:
ONC(=O)C1(CS(=O)(=O)c2ccc(Oc3ccccc3)cc2)CCN(CC#C)CC1
: