Target
Disintegrin and metalloproteinase domain-containing protein 10
Ligand
BDBM50229653
Substrate
Meas. Tech.
ChEMBL_461862 (CHEMBL927855)
IC50
286±n/a nM
Citation
 Burns, DMHe, CLi, YScherle, PLiu, XMarando, CACovington, MBYang, GPan, MTurner, SFridman, JSHollis, GVaddi, KYeleswaram, SNewton, RFriedman, SMetcalf, BYao, W Conversion of an MMP-potent scaffold to an MMP-selective HER-2 sheddase inhibitor via scaffold hybridization and subtle P1' permutations. Bioorg Med Chem Lett 18:560-4 (2008)  
Target
Name:
Disintegrin and metalloproteinase domain-containing protein 10
Synonyms:
ADA10_HUMAN Disintegrin and metalloproteinase domain-containing protein 10 (ADAM10) MADM
Type:
Enzyme
Mol. Mass.:
84160.93
Organism:
Homo sapiens (Human)
Description:
O14672
Residue:
748
  
Inhibitor
Name:
BDBM50229653
Synonyms:
(S)-tetrahydrofuran-3-yl 4-((4-(3,5-dimethylphenyl)piperidin-1-ylsulfonyl)methyl)-4-(hydroxycarbamoyl)piperidine-1-carboxylate | CHEMBL254510
Type:
Small organic molecule
Emp. Form.:
C25H37N3O7S
Mol. Mass.:
523.642
SMILES:
Cc1cc(C)cc(c1)C1CCN(CC1)S(=O)(=O)CC1(CCN(CC1)C(=O)O[C@H]1CCOC1)C(=O)NO
: