Target
3-hydroxy-3-methylglutaryl-coenzyme A reductase
Ligand
BDBM22164
Substrate
Meas. Tech.
ChEMBL_461936 (CHEMBL944783)
IC50
3.8±n/a nM
Citation
 Park, WKKennedy, RMLarsen, SDMiller, SRoth, BDSong, YSteinbaugh, BASun, KTait, BDKowala, MCTrivedi, BKAuerbach, BAskew, VDillon, LHanselman, JCLin, ZLu, GHRobertson, ASekerke, C Hepatoselectivity of statins: design and synthesis of 4-sulfamoyl pyrroles as HMG-CoA reductase inhibitors. Bioorg Med Chem Lett 18:1151-6 (2008)  
Target
Name:
3-hydroxy-3-methylglutaryl-coenzyme A reductase
Synonyms:
HMDH_RAT Hmgcr
Type:
Enzyme
Mol. Mass.:
96689.85
Organism:
Rattus norvegicus (rat)
Description:
Isolated rat liver microsomes were used as enzyme source.
Residue:
887
  
Inhibitor
Name:
BDBM22164
Synonyms:
(3R,5R)-7-[2-(4-fluorophenyl)-3-phenyl-4-(phenylcarbamoyl)-5-(propan-2-yl)-1H-pyrrol-1-yl]-3,5-dihydroxyheptanoic acid Atorvastatin CI 981 US9353061, Atorvastatina
Type:
Small organic molecule
Emp. Form.:
C33H35FN2O5
Mol. Mass.:
558.6398
SMILES:
CC(C)c1c(C(=O)Nc2ccccc2)c(c(-c2ccc(F)cc2)n1CC[C@@H](O)C[C@@H](O)CC(O)=O)-c1ccccc1
: