Target
Cathepsin D
Ligand
BDBM50231689
Substrate
Meas. Tech.
ChEMBL_462059 (CHEMBL945833)
IC50
5620±n/a nM
Citation
 Clarke, BDemont, EDingwall, CDunsdon, RFaller, AHawkins, JHussain, IMacPherson, DMaile, GMatico, RMilner, PMosley, JNaylor, AO'Brien, ARedshaw, SRiddell, DRowland, PSoleil, VSmith, KJStanway, SStemp, GSweitzer, STheobald, PVesey, DWalter, DSWard, JWayne, G BACE-1 inhibitors part 2: identification of hydroxy ethylamines (HEAs) with reduced peptidic character. Bioorg Med Chem Lett 18:1017-21 (2008)  
Target
Name:
Cathepsin D
Synonyms:
CATD_HUMAN CTSD Cathepsin D heavy chain Cathepsin D precursor
Type:
Enzyme
Mol. Mass.:
44551.72
Organism:
Homo sapiens (Human)
Description:
Human proCathepsin D (SwissProt accession number P07339) was expressed in Sf9 cells, purified, and autoactivated.
Residue:
412
  
Inhibitor
Name:
BDBM50231689
Synonyms:
CHEMBL253719 | N-((2S,3R)-4-(3-chlorobenzylamino)-3-hydroxy-1-phenylbutan-2-yl)-3-(ethylamino)-5-(2-oxopyrrolidin-1-yl)benzamide
Type:
Small organic molecule
Emp. Form.:
C30H35ClN4O3
Mol. Mass.:
535.077
SMILES:
CCNc1cc(cc(c1)C(=O)N[C@@H](Cc1ccccc1)[C@H](O)CNCc1cccc(Cl)c1)N1CCCC1=O
: