Target
Sodium/glucose cotransporter 1
Ligand
BDBM50242615
Substrate
Meas. Tech.
ChEMBL_534075 (CHEMBL974294)
IC50
2±n/a nM
Citation
 Vernaleken, AVeyhl, MGorboulev, VKottra, GPalm, DBurckhardt, BCBurckhardt, GPipkorn, RBeier, Nvan Amsterdam, CKoepsell, H Tripeptides of RS1 (RSC1A1) inhibit a monosaccharide-dependent exocytotic pathway of Na+-D-glucose cotransporter SGLT1 with high affinity. J Biol Chem 282:28501-13 (2007)  
Target
Name:
Sodium/glucose cotransporter 1
Synonyms:
High affinity sodium-glucose cotransporter Na(+)/glucose cotransporter 1 SGLT1 Sodium-dependent glucose cotransporter 1 (SGLT1) Sodium/glucose cotransporter 1 (SGLT1) | Solute carrier family 5 member 1
Type:
Protein
Mol. Mass.:
73503.78
Organism:
Homo sapiens (Human)
Description:
P13866
Residue:
664
  
Inhibitor
Name:
BDBM50242615
Synonyms:
CHEMBL486028 | QCPac
Type:
Small organic molecule
Emp. Form.:
C13H21N3O5S
Mol. Mass.:
331.388
SMILES:
C[C@H](NC(=O)[C@@H]1CCCN1C(C)=O)C(=O)N[C@@H](CS)C(O)=O
: