Target
Cyclin-dependent kinase 2
Ligand
BDBM8388
Substrate
Meas. Tech.
ChEMBL_510894 (CHEMBL997786)
IC50
484±n/a nM
Citation
 Patel, DSBharatam, PV Selectivity criterion for pyrazolo[3,4-b]pyrid[az]ine derivatives as GSK-3 inhibitors: CoMFA and molecular docking studies. Eur J Med Chem 43:949-57 (2008)  
Target
Name:
Cyclin-dependent kinase 2
Synonyms:
CDK2 CDK2_HUMAN Cell division protein kinase 2 Protein cereblon/Cyclin-dependent kinase 2 | p33 protein kinase
Type:
Enzyme Subunit
Mol. Mass.:
33938.17
Organism:
Homo sapiens (Human)
Description:
P24941
Residue:
298
  
Inhibitor
Name:
BDBM8388
Synonyms:
CHEMBL260928 indazole analogue 30
Type:
Small organic molecule
Emp. Form.:
C15H13N3OS
Mol. Mass.:
283.348
SMILES:
O=C(Nc1n[nH]c2cc(ccc12)-c1ccsc1)C1CC1
: