Target
Cyclin-dependent kinase 2
Ligand
BDBM8357
Substrate
Meas. Tech.
ChEMBL_510894 (CHEMBL997786)
IC50
60±n/a nM
Citation
 Patel, DSBharatam, PV Selectivity criterion for pyrazolo[3,4-b]pyrid[az]ine derivatives as GSK-3 inhibitors: CoMFA and molecular docking studies. Eur J Med Chem 43:949-57 (2008)  
Target
Name:
Cyclin-dependent kinase 2
Synonyms:
CDK2 CDK2_HUMAN Cell division protein kinase 2 Protein cereblon/Cyclin-dependent kinase 2 | p33 protein kinase
Type:
Enzyme Subunit
Mol. Mass.:
33938.17
Organism:
Homo sapiens (Human)
Description:
P24941
Residue:
298
  
Inhibitor
Name:
BDBM8357
Synonyms:
6-aryl-pyrazolo[3,4-b]pyridine analogue 21 N-[5-bromo-6-(4-hydroxyphenyl)-1H-pyrazolo[3,4-b]pyridin-3-yl]-4-(4-ethylpiperazin-1-yl)butanamide | pyrazolo[3,4-b]pyridine analogue 9
Type:
Small organic molecule
Emp. Form.:
C22H27BrN6O2
Mol. Mass.:
487.393
SMILES:
CCN1CCN(CCCC(=O)Nc2n[nH]c3nc(c(Br)cc23)-c2ccc(O)cc2)CC1
: