Target
Squalene synthase
Ligand
BDBM50270299
Substrate
Meas. Tech.
ChEMBL_520603 (CHEMBL959525)
IC50
>1000±n/a nM
Citation
 Cammerer, SBJimenez, CJones, SGros, LLorente, SORodrigues, CRodrigues, JCCaldera, ARuiz Perez, LMda Souza, WKaiser, MBrun, RUrbina, JAGonzalez Pacanowska, DGilbert, IH Quinuclidine derivatives as potential antiparasitics. Antimicrob Agents Chemother 51:4049-61 (2007)  
Target
Name:
Squalene synthase
Synonyms:
Farnesyltransferase, putative
Type:
PROTEIN
Mol. Mass.:
47117.40
Organism:
Leishmania major
Description:
ChEMBL_520603
Residue:
414
  
Inhibitor
Name:
BDBM50270299
Synonyms:
(E)-3-[4'-(1'',3''-Dioxolanyl)-benzylidene]-quinuclidine | CHEMBL478912
Type:
Small organic molecule
Emp. Form.:
C17H21NO2
Mol. Mass.:
271.3541
SMILES:
C1COC(O1)c1ccc(\C=C2\CN3CCC2CC3)cc1
: