Target
Cyclin-dependent kinase 2
Ligand
BDBM7110
Substrate
Meas. Tech.
ChEMBL_519498 (CHEMBL951804)
IC50
455±n/a nM
Citation
 Mascarenhas, NMGhoshal, N An efficient tool for identifying inhibitors based on 3D-QSAR and docking using feature-shape pharmacophore of biologically active conformation--a case study with CDK2/cyclinA. Eur J Med Chem 43:2807-18 (2008)  
Target
Name:
Cyclin-dependent kinase 2
Synonyms:
CDK2 CDK2_HUMAN Cell division protein kinase 2 Protein cereblon/Cyclin-dependent kinase 2 | p33 protein kinase
Type:
Enzyme Subunit
Mol. Mass.:
33938.17
Organism:
Homo sapiens (Human)
Description:
P24941
Residue:
298
  
Inhibitor
Name:
BDBM7110
Synonyms:
(2R)-N-(5-Cyclopropyl-1H-pyrazol-3-yl)-2-[4-(2-oxoimidazolidin-1-yl)phenyl]propanamide CHEMBL189047
Type:
Small organic molecule
Emp. Form.:
C18H21N5O2
Mol. Mass.:
339.3916
SMILES:
C[C@@H](C(=O)Nc1cc(n[nH]1)C1CC1)c1ccc(cc1)N1CCNC1=O
: