Target
72 kDa type IV collagenase
Ligand
BDBM50247218
Substrate
Meas. Tech.
ChEMBL_518899 (CHEMBL940643)
IC50
100±n/a nM
Citation
 Cheng, XCWang, QFang, HTang, WXu, WF Design, synthesis and preliminary evaluation of novel pyrrolidine derivatives as matrix metalloproteinase inhibitors. Eur J Med Chem 43:2130-9 (2008)  
Target
Name:
72 kDa type IV collagenase
Synonyms:
72 kDa gelatinase CLG4A Gelatinase A (MMP-2) MMP2_HUMAN Matrix metalloproteinase-2 (MMP 2) Matrix metalloproteinases 2 (MMP-2) | TBE-1
Type:
Enzyme
Mol. Mass.:
73870.36
Organism:
Homo sapiens (Human)
Description:
P08253
Residue:
660
  
Inhibitor
Name:
BDBM50247218
Synonyms:
(2S,4S)-Methyl 1-acetyl-4-(cinnamamido)pyrrolidine-2-carboxylate | CHEMBL514307
Type:
Small organic molecule
Emp. Form.:
C17H20N2O4
Mol. Mass.:
316.3517
SMILES:
COC(=O)[C@@H]1C[C@@H](CN1C(C)=O)NC(=O)\C=C\c1ccccc1
: