Target
Aminopeptidase N
Ligand
BDBM50247218
Substrate
Meas. Tech.
ChEMBL_518900 (CHEMBL940644)
IC50
135300±n/a nM
Citation
 Cheng, XCWang, QFang, HTang, WXu, WF Design, synthesis and preliminary evaluation of novel pyrrolidine derivatives as matrix metalloproteinase inhibitors. Eur J Med Chem 43:2130-9 (2008)  
Target
Name:
Aminopeptidase N
Synonyms:
AMPN_HUMAN APN Aminopeptidase CD_antigen=CD13 Myeloid plasma membrane glycoprotein CD13 gp150 | hAPN
Type:
PROTEIN
Mol. Mass.:
109522.63
Organism:
Homo sapiens (Human)
Description:
ChEMBL_1507526
Residue:
967
  
Inhibitor
Name:
BDBM50247218
Synonyms:
(2S,4S)-Methyl 1-acetyl-4-(cinnamamido)pyrrolidine-2-carboxylate | CHEMBL514307
Type:
Small organic molecule
Emp. Form.:
C17H20N2O4
Mol. Mass.:
316.3517
SMILES:
COC(=O)[C@@H]1C[C@@H](CN1C(C)=O)NC(=O)\C=C\c1ccccc1
: