Target
Lanosterol synthase
Ligand
BDBM50271621
Substrate
Meas. Tech.
ChEMBL_556115 (CHEMBL956674)
IC50
20±n/a nM
Citation
 Fouchet, MHDonche, FMartin, CBouillot, AJunot, CBoullay, ABPotvain, FMagny, SDCoste, HWalker, MIssandou, MDodic, N Design and evaluation of a novel series of 2,3-oxidosqualene cyclase inhibitors with low systemic exposure, relationship between pharmacokinetic properties and ocular toxicity. Bioorg Med Chem 16:6218-32 (2008)  
Target
Name:
Lanosterol synthase
Synonyms:
2,3-epoxysqualene--lanosterol cyclase LSS_HUMAN Oxidosqualene--lanosterol cyclase
Type:
PROTEIN
Mol. Mass.:
83309.32
Organism:
Homo sapiens (Human)
Description:
ChEMBL_11231
Residue:
732
  
Inhibitor
Name:
BDBM50271621
Synonyms:
1-[4-(Trifluoromethoxy)phenylcarbonyl]-4-[4-(dimethylaminomethyl)phenylmeth yl]-piperazine | CHEMBL482532
Type:
Small organic molecule
Emp. Form.:
C22H26F3N3O2
Mol. Mass.:
421.4559
SMILES:
CN(C)Cc1ccc(CN2CCN(CC2)C(=O)c2ccc(OC(F)(F)F)cc2)cc1
: