Target
Lanosterol synthase
Ligand
BDBM50271573
Substrate
Meas. Tech.
ChEMBL_556115 (CHEMBL956674)
IC50
316±n/a nM
Citation
 Fouchet, MHDonche, FMartin, CBouillot, AJunot, CBoullay, ABPotvain, FMagny, SDCoste, HWalker, MIssandou, MDodic, N Design and evaluation of a novel series of 2,3-oxidosqualene cyclase inhibitors with low systemic exposure, relationship between pharmacokinetic properties and ocular toxicity. Bioorg Med Chem 16:6218-32 (2008)  
Target
Name:
Lanosterol synthase
Synonyms:
2,3-epoxysqualene--lanosterol cyclase LSS_HUMAN Oxidosqualene--lanosterol cyclase
Type:
PROTEIN
Mol. Mass.:
83309.32
Organism:
Homo sapiens (Human)
Description:
ChEMBL_11231
Residue:
732
  
Inhibitor
Name:
BDBM50271573
Synonyms:
1-[4-Chlorobenzyl]-4-[4-(pyridin-4-yl)phenylmethyl]-piperazine | CHEMBL482528
Type:
Small organic molecule
Emp. Form.:
C23H24ClN3
Mol. Mass.:
377.91
SMILES:
Clc1ccc(CN2CCN(Cc3ccc(cc3)-c3ccncc3)CC2)cc1
: