Target
Vascular endothelial growth factor receptor 1
Ligand
BDBM50247802
Substrate
Meas. Tech.
ChEMBL_556140 (CHEMBL957462)
IC50
19200±n/a nM
Citation
 Gangjee, ANamjoshi, OAYu, JIhnat, MAThorpe, JEWarnke, LA Design, synthesis and biological evaluation of substituted pyrrolo[2,3-d]pyrimidines as multiple receptor tyrosine kinase inhibitors and antiangiogenic agents. Bioorg Med Chem 16:5514-28 (2008)  
Target
Name:
Vascular endothelial growth factor receptor 1
Synonyms:
FLT FRT Fms-like tyrosine kinase 1 Tyrosine-protein kinase FRT VEGFR-1 VGFR1_HUMAN Vascular endothelial growth factor receptor 1 (FLT1) Vascular endothelial growth factor receptor 1 and 2 (Flt-1 and KDR) Vascular permeability factor receptor vascular endothelial growth factor/vascular permeability factor receptor
Type:
Receptor Tyrosine Kinase
Mol. Mass.:
150800.23
Organism:
Homo sapiens (Human)
Description:
P17948
Residue:
1338
  
Inhibitor
Name:
BDBM50247802
Synonyms:
CHEMBL474538 N4-(3-bromophenyl)-6-(naphthalen-1-ylmethyl)-7H-pyrrolo[2,3-d]pyrimidine-2,4-diamine
Type:
Small organic molecule
Emp. Form.:
C23H18BrN5
Mol. Mass.:
444.327
SMILES:
Nc1nc(Nc2cccc(Br)c2)c2cc(Cc3cccc4ccccc34)[nH]c2n1
: