Target
Platelet-derived growth factor receptor beta
Ligand
BDBM50271908
Substrate
Meas. Tech.
ChEMBL_556142 (CHEMBL957464)
IC50
>50000±n/a nM
Citation
 Gangjee, ANamjoshi, OAYu, JIhnat, MAThorpe, JEWarnke, LA Design, synthesis and biological evaluation of substituted pyrrolo[2,3-d]pyrimidines as multiple receptor tyrosine kinase inhibitors and antiangiogenic agents. Bioorg Med Chem 16:5514-28 (2008)  
Target
Name:
Platelet-derived growth factor receptor beta
Synonyms:
Beta-type platelet-derived growth factor receptor CD140b antigen PDGF Receptor Substrate PDGFR PDGFR-1 PDGFRB PGFRB_HUMAN Platelet-derived growth factor receptor 1 Platelet-derived growth factor receptor beta (PDGFR-beta) Platelet-derived growth factor receptor beta (PDGFRbeta) | VHL/PDGFRB
Type:
Enzyme
Mol. Mass.:
123922.25
Organism:
Homo sapiens (Human)
Description:
P09619
Residue:
1106
  
Inhibitor
Name:
BDBM50271908
Synonyms:
CHEMBL502015 | N4-(3-bromophenyl)-2-(naphthalen-2-ylmethyl)-1H-indole-4,6-diamine
Type:
Small organic molecule
Emp. Form.:
C23H18BrN5
Mol. Mass.:
444.327
SMILES:
Nc1nc(Nc2cccc(Br)c2)c2cc(Cc3ccc4ccccc4c3)[nH]c2n1
: