Target
Epidermal growth factor receptor
Ligand
BDBM50271852
Substrate
Meas. Tech.
ChEMBL_556139 (CHEMBL957461)
IC50
122000±n/a nM
Citation
 Gangjee, ANamjoshi, OAYu, JIhnat, MAThorpe, JEWarnke, LA Design, synthesis and biological evaluation of substituted pyrrolo[2,3-d]pyrimidines as multiple receptor tyrosine kinase inhibitors and antiangiogenic agents. Bioorg Med Chem 16:5514-28 (2008)  
Target
Name:
Epidermal growth factor receptor
Synonyms:
EGF Receptor Substrate EGFR_HUMAN ERBB1 Epidermal Growth Factor Receptor erbB-1 Epidermal growth factor receptor (EGFR) HER1 Proto-oncogene c-ErbB-1 Tyrosine-Protein Kinase ErbB-1
Type:
Receptor Kinase Domain
Mol. Mass.:
134279.59
Organism:
Homo sapiens (Human)
Description:
P00533
Residue:
1210
  
Inhibitor
Name:
BDBM50271852
Synonyms:
CHEMBL482715 N4-[4-Fluoro-3-(trifluoromethyl)phenyl]-6-(2-phenylethyl)-7H-pyrrolo[2,3-d]pyrimidine-2,4-diamine
Type:
Small organic molecule
Emp. Form.:
C21H17F4N5
Mol. Mass.:
415.3868
SMILES:
Nc1nc(Nc2ccc(F)c(c2)C(F)(F)F)c2cc(CCc3ccccc3)[nH]c2n1
: