Target
Vascular endothelial growth factor receptor 2
Ligand
BDBM50271905
Substrate
Meas. Tech.
ChEMBL_556141 (CHEMBL957463)
IC50
24900±n/a nM
Citation
 Gangjee, ANamjoshi, OAYu, JIhnat, MAThorpe, JEWarnke, LA Design, synthesis and biological evaluation of substituted pyrrolo[2,3-d]pyrimidines as multiple receptor tyrosine kinase inhibitors and antiangiogenic agents. Bioorg Med Chem 16:5514-28 (2008)  
Target
Name:
Vascular endothelial growth factor receptor 2
Synonyms:
CD_antigen=CD309 Fetal liver kinase 1 (FLK-1) KDR Protein-tyrosine kinase receptor Flk-1 VEGFR-2 VEGFR2 Vascular Endothelial Growth Factor Receptor Kinase 2 Vascular endothelial growth factor receptor 2 (KDR) Vascular endothelial growth factor receptor 2 (VEGFR2) Vascular endothelial growth factor receptor-2 (VEGFR-2)
Type:
Receptor Tyrosine Kinase
Mol. Mass.:
151510.97
Organism:
Homo sapiens (Human)
Description:
P35968
Residue:
1356
  
Inhibitor
Name:
BDBM50271905
Synonyms:
CHEMBL499067 N4-1H-indol-5-yl-6-(2-phenylethyl)-7H-pyrrolo[2,3-d]pyrimidine-2,4-diamine
Type:
Small organic molecule
Emp. Form.:
C22H20N6
Mol. Mass.:
368.4344
SMILES:
Nc1nc(Nc2ccc3[nH]ccc3c2)c2cc(CCc3ccccc3)[nH]c2n1
: