Target
Platelet-derived growth factor receptor beta
Ligand
BDBM50271759
Substrate
Meas. Tech.
ChEMBL_556142 (CHEMBL957464)
IC50
>50000±n/a nM
Citation
 Gangjee, ANamjoshi, OAYu, JIhnat, MAThorpe, JEWarnke, LA Design, synthesis and biological evaluation of substituted pyrrolo[2,3-d]pyrimidines as multiple receptor tyrosine kinase inhibitors and antiangiogenic agents. Bioorg Med Chem 16:5514-28 (2008)  
Target
Name:
Platelet-derived growth factor receptor beta
Synonyms:
Beta-type platelet-derived growth factor receptor CD140b antigen PDGF Receptor Substrate PDGFR PDGFR-1 PDGFRB PGFRB_HUMAN Platelet-derived growth factor receptor 1 Platelet-derived growth factor receptor beta (PDGFR-beta) Platelet-derived growth factor receptor beta (PDGFRbeta) | VHL/PDGFRB
Type:
Enzyme
Mol. Mass.:
123922.25
Organism:
Homo sapiens (Human)
Description:
P09619
Residue:
1106
  
Inhibitor
Name:
BDBM50271759
Synonyms:
CHEMBL485321 | N4-(3-Bromophenyl)-6-[2-(4-methoxyphenyl)ethyl]-7H-pyrrolo[2,3-d]pyrimidine-2,4-diamine
Type:
Small organic molecule
Emp. Form.:
C21H20BrN5O
Mol. Mass.:
438.32
SMILES:
COc1ccc(CCc2cc3c(Nc4cccc(Br)c4)nc(N)nc3[nH]2)cc1
: