Target
Epidermal growth factor receptor
Ligand
BDBM50271908
Substrate
Meas. Tech.
ChEMBL_556139 (CHEMBL957461)
IC50
1240±n/a nM
Citation
 Gangjee, ANamjoshi, OAYu, JIhnat, MAThorpe, JEWarnke, LA Design, synthesis and biological evaluation of substituted pyrrolo[2,3-d]pyrimidines as multiple receptor tyrosine kinase inhibitors and antiangiogenic agents. Bioorg Med Chem 16:5514-28 (2008)  
Target
Name:
Epidermal growth factor receptor
Synonyms:
EGF Receptor Substrate EGFR_HUMAN ERBB1 Epidermal Growth Factor Receptor erbB-1 Epidermal growth factor receptor (EGFR) HER1 Proto-oncogene c-ErbB-1 Tyrosine-Protein Kinase ErbB-1
Type:
Receptor Kinase Domain
Mol. Mass.:
134279.59
Organism:
Homo sapiens (Human)
Description:
P00533
Residue:
1210
  
Inhibitor
Name:
BDBM50271908
Synonyms:
CHEMBL502015 | N4-(3-bromophenyl)-2-(naphthalen-2-ylmethyl)-1H-indole-4,6-diamine
Type:
Small organic molecule
Emp. Form.:
C23H18BrN5
Mol. Mass.:
444.327
SMILES:
Nc1nc(Nc2cccc(Br)c2)c2cc(Cc3ccc4ccccc4c3)[nH]c2n1
: