Target
5-hydroxytryptamine receptor 2A
Ligand
BDBM50248851
Substrate
Meas. Tech.
ChEMBL_542151 (CHEMBL1009861)
Ki
9720±n/a nM
Citation
 Bojarski, AJKuran, BKossakowski, JKoziol, AJagiello-Wójtowicz, EChodkowska, A Synthesis and serotonin receptor activity of the arylpiperazine alkyl/propoxy derivatives of new azatricycloundecanes. Eur J Med Chem 44:152-64 (2008)  
Target
Name:
5-hydroxytryptamine receptor 2A
Synonyms:
5-HT-2 5-HT2A 5-hydroxytryptamine receptor 2A (5HT-2A) 5HT2A_HUMAN HTR2A | Serotonin receptor 2A
Type:
undefined
Mol. Mass.:
52607.65
Organism:
Homo sapiens (Human)
Description:
P28223
Residue:
471
  
Inhibitor
Name:
BDBM50248851
Synonyms:
4-[4-(4-Benzylpiperazin-1-yl)butyl]-8,11-dimethyl-3,5-dioxo-4-azatricyclo[5.2.2.0(2,6)]undec-8-en-1-yl acetate | CHEMBL472774
Type:
Small organic molecule
Emp. Form.:
C29H39N3O4
Mol. Mass.:
493.6377
SMILES:
CC1CC2(OC(C)=O)C=C(C)C1C1C2C(=O)N(CCCCN2CCN(Cc3ccccc3)CC2)C1=O
: