Target
Cyclin-dependent kinase 4
Ligand
BDBM50271267
Substrate
Meas. Tech.
ChEMBL_556875 (CHEMBL964735)
IC50
130±n/a nM
Citation
 Tsou, HROtteng, MTran, TFloyd, MBReich, MBirnberg, GKutterer, KAyral-Kaloustian, SRavi, MNilakantan, RGrillo, MMcGinnis, JPRabindran, SK 4-(Phenylaminomethylene)isoquinoline-1,3(2H,4H)-diones as potent and selective inhibitors of the cyclin-dependent kinase 4 (CDK4). J Med Chem 51:3507-25 (2008)  
Target
Name:
Cyclin-dependent kinase 4
Synonyms:
CDK4 Cell division protein kinase 4 PSK-J3
Type:
Enzyme Subunit
Mol. Mass.:
33731.96
Organism:
Homo sapiens (Human)
Description:
P11802
Residue:
303
  
Inhibitor
Name:
BDBM50271267
Synonyms:
(4Z)-6-(4-Methoxyphenyl)-4-({[4-(piperidin-1-ylmethyl)phenyl]-amino}methylene)-isoquinoline-1,3(2H,4H)-dione | CHEMBL483530
Type:
Small organic molecule
Emp. Form.:
C29H29N3O3
Mol. Mass.:
467.5589
SMILES:
COc1ccc(cc1)-c1ccc2C(=O)NC(=O)C(=CNc3ccc(CN4CCCCC4)cc3)c2c1
: