Target
5-hydroxytryptamine receptor 1D
Ligand
BDBM50070409
Substrate
Meas. Tech.
ChEMBL_552732 (CHEMBL965238)
Ki
0.400000±n/a nM
Citation
 Choi, SKGreen, DHo, AKlein, UMarquess, DTaylor, RTurner, SD Designing selective, high affinity ligands of 5-HT1D receptor by covalent dimerization of 5-HT1F ligands derived from 4-fluoro-N-[3-(1-methyl-4-piperidinyl)-1H-indol-5-yl]benzamide. J Med Chem 51:3609-16 (2008)  
Target
Name:
5-hydroxytryptamine receptor 1D
Synonyms:
5-HT-1D 5-HT1D 5HT1D_HUMAN HTR1DA Serotonin (5-HT) receptor | Serotonin Receptor 1D
Type:
G Protein-Coupled Receptor (GPCR)
Mol. Mass.:
41920.63
Organism:
Homo sapiens (Human)
Description:
Receptor binding assays were performed using human clone stably expressed in CHO cells.
Residue:
377
  
Inhibitor
Name:
BDBM50070409
Synonyms:
2-(5-(2-(8-(4-methylpiperazin-1-yl)naphthalen-2-yloxy)ethoxy)-1H-indol-3-yl)ethanamine CHEMBL31217
Type:
Small organic molecule
Emp. Form.:
C27H32N4O2
Mol. Mass.:
444.5686
SMILES:
CN1CCN(CC1)c1cccc2ccc(OCCOc3ccc4[nH]cc(CCN)c4c3)cc12
: