Target
Progesterone receptor
Ligand
BDBM8903
Substrate
Meas. Tech.
ChEMBL_491263 (CHEMBL989216)
Ki
3.4±n/a nM
Citation
 Pedram, Bvan Oeveren, AMais, DEMarschke, KBVerbost, PMGroen, MBZhi, L A tissue-selective nonsteroidal progesterone receptor modulator: 7,9-difluoro-5-(3-methylcyclohex-2-enyl)-2,2,4-trimethyl-1,2-dihydrochromeno[3,4-f]quinoline. J Med Chem 51:3696-9 (2008)  
Target
Name:
Progesterone receptor
Synonyms:
NR3C3 PGR PRGR_HUMAN | progesterone
Type:
Protein
Mol. Mass.:
98979.52
Organism:
Homo sapiens (Human)
Description:
P06401
Residue:
933
  
Inhibitor
Name:
BDBM8903
Synonyms:
(1S,2R,10S,11S,14S,15S)-14-acetyl-2,15-dimethyltetracyclo[8.7.0.0^{2,7}.0^{11,15}]heptadec-6-en-5-one progesterone
Type:
Steroid
Emp. Form.:
C21H30O2
Mol. Mass.:
314.4617
SMILES:
[H][C@@]12CC[C@H](C(C)=O)[C@@]1(C)CC[C@@]1([H])[C@@]2([H])CCC2=CC(=O)CC[C@]12C
: