Target
Vascular endothelial growth factor receptor 2
Ligand
BDBM50242919
Substrate
Meas. Tech.
ChEMBL_492359 (CHEMBL948355)
IC50
55±n/a nM
Citation
 Frey, RRCurtin, MLAlbert, DHGlaser, KBPease, LJSoni, NBBouska, JJReuter, DStewart, KDMarcotte, PBukofzer, GLi, JDavidsen, SKMichaelides, MR 7-Aminopyrazolo[1,5-a]pyrimidines as potent multitargeted receptor tyrosine kinase inhibitors. J Med Chem 51:3777-87 (2008)  
Target
Name:
Vascular endothelial growth factor receptor 2
Synonyms:
CD_antigen=CD309 Fetal liver kinase 1 (FLK-1) KDR Protein-tyrosine kinase receptor Flk-1 VEGFR-2 VEGFR2 Vascular Endothelial Growth Factor Receptor Kinase 2 Vascular endothelial growth factor receptor 2 (KDR) Vascular endothelial growth factor receptor 2 (VEGFR2) Vascular endothelial growth factor receptor-2 (VEGFR-2)
Type:
Receptor Tyrosine Kinase
Mol. Mass.:
151510.97
Organism:
Homo sapiens (Human)
Description:
P35968
Residue:
1356
  
Inhibitor
Name:
BDBM50242919
Synonyms:
1-{4-[7-Amino-3-(1-methyl-1H-pyrazol-4-yl)pyrazolo[1,5-a]pyrimidin-6-yl]phenyl}-3-(4-fluoro-3-trifluoromethylphenyl)urea | CHEMBL469455
Type:
Small organic molecule
Emp. Form.:
C25H19F4N7O
Mol. Mass.:
509.4583
SMILES:
Cn1cc(cn1)-c1ccn2c(N)c(cnc12)-c1ccc(NC(=O)Nc2ccc(F)c(c2)C(F)(F)F)cc1
: