Target
11-beta-hydroxysteroid dehydrogenase 1
Ligand
BDBM50252313
Substrate
Meas. Tech.
ChEMBL_487968 (CHEMBL1013099)
IC50
11±n/a nM
Citation
 Xiang, JWan, ZKLi, HQIpek, MBinnun, ENunez, JChen, LMcKew, JCMansour, TSXu, XSuri, VTam, MXing, YLi, XHahm, STobin, JSaiah, E Piperazine sulfonamides as potent, selective, and orally available 11beta-hydroxysteroid dehydrogenase type 1 inhibitors with efficacy in the rat cortisone-induced hyperinsulinemia model. J Med Chem 51:4068-71 (2008)  
Target
Name:
11-beta-hydroxysteroid dehydrogenase 1
Synonyms:
11-DH 11-beta-Hydroxysteroid Dehydrogenase 1 (11-beta-HSD1) 11beta-HSD1A Corticosteroid 11-beta-dehydrogenase isozyme 1 (11-beta-HSD-1) Hsd11 | Hsd11b1
Type:
Enzyme
Mol. Mass.:
32369.70
Organism:
Mus musculus (mouse)
Description:
P50172
Residue:
292
  
Inhibitor
Name:
BDBM50252313
Synonyms:
CHEMBL516457 | Methyl 4-[3-({(2R)-4-[4-fluoro-2-(trifluoromethyl)phenyl]-2-methylpiperazin-1-yl}sulfonyl)phenyl]piperazine-1-carboxylate
Type:
Small organic molecule
Emp. Form.:
C24H28F4N4O4S
Mol. Mass.:
544.562
SMILES:
COC(=O)N1CCN(CC1)c1cccc(c1)S(=O)(=O)N1CCN(C[C@H]1C)c1ccc(F)cc1C(F)(F)F
: