Target
Leukotriene A-4 hydrolase
Ligand
BDBM50251498
Substrate
Meas. Tech.
ChEMBL_488137 (CHEMBL987428)
IC50
330±n/a nM
Citation
 Ye, BBauman, JChen, MDavey, DKhim, SKKing, BKirkland, TKochanny, MLiang, ALentz, DMay, KMendoza, LPhillips, GSelchau, VSchlyer, STseng, JLWei, RGYe, HParkinson, JGuilford, WJ Synthesis of N-alkyl glycine amides as potent inhibitors of leukotriene A4 hydrolase. Bioorg Med Chem Lett 18:3891-4 (2008)  
Target
Name:
Leukotriene A-4 hydrolase
Synonyms:
LKHA4_HUMAN LTA4 Leukotriene A(4) hydrolase Leukotriene A4 hydrolase
Type:
Hydrolase; metalloprotease
Mol. Mass.:
69280.41
Organism:
Homo sapiens (Human)
Description:
Human recombinant LTA4H.
Residue:
611
  
Inhibitor
Name:
BDBM50251498
Synonyms:
4-((methyl(3-(2-oxo-2-(4-phenoxyphenylamino)ethylamino)propyl)amino)methyl)benzoic acid | CHEMBL482252
Type:
Small organic molecule
Emp. Form.:
C26H29N3O4
Mol. Mass.:
447.5262
SMILES:
CN(CCCNCC(=O)Nc1ccc(Oc2ccccc2)cc1)Cc1ccc(cc1)C(O)=O
: