Target
Group IIE secretory phospholipase A2
Ligand
BDBM50053137
Substrate
Meas. Tech.
ChEMBL_489274 (CHEMBL990830)
IC50
10±n/a nM
Citation
 Oslund, RCCermak, NGelb, MH Highly specific and broadly potent inhibitors of mammalian secreted phospholipases A2. J Med Chem 51:4708-14 (2008)  
Target
Name:
Group IIE secretory phospholipase A2
Synonyms:
GIIE sPLA2 PLA2G2E sPLA(2)-IIE
Type:
PROTEIN
Mol. Mass.:
15997.10
Organism:
Homo sapiens (Human)
Description:
ChEMBL_489274
Residue:
142
  
Inhibitor
Name:
BDBM50053137
Synonyms:
(1-Aminooxalyl-3-biphenyl-2-ylmethyl-2-ethyl-indolizin-8-yloxy)-acetic acid | CHEMBL332993
Type:
Small organic molecule
Emp. Form.:
C27H24N2O5
Mol. Mass.:
456.4899
SMILES:
CCc1c(Cc2ccccc2-c2ccccc2)n2cccc(OCC(O)=O)c2c1C(=O)C(N)=O
: